{"text_format":"1","workbook":"xlsx","n_sheets":3,"sheets":["はじめにお読み下さい","リスト","中野優勝旗"],"not_rendered":{"charts":0,"images":6,"macros":1,"external_links":1,"defined_names":6,"comments":0,"pivot_tables":0},"unopened":[],"bounds":{"document_bytes":16777216,"sheet_cells":100000,"rows_first":2000,"rows_last":500,"rows_between":2000,"halvings":0,"cell_chars":16384,"cell_head_chars":4096},"cells_cut":0,"cells_raw":0,"read":"whole","date_system":"1900"}

{"sheet":"はじめにお読み下さい","index":0,"n_rows":57,"n_cols":9,"rows_kept":57,"cut":false,"hidden":false,"merged":[]}
["使い方（はじめにお読みください）"]
[null,"はじめに"]
[null,null,"利用のためにはマクロを有効にする必要があります。マクロが有効になっていない場合には以下の手順を先にお願いします。"]
[null,null,"ただし、お使いのコンピュータ環境によっては、毎回この工程が必要な場合があります。"]
[null,null,"手順：ファイルを開いた直後、下のようなメッセージが出ますので、「オプション」をクリック後、「このコンテンツを有効にする」を選び、「OK」を押して下さい。"]
[]
[]
[]
[]
[]
[]
[]
[]
[]
[]
[]
[]
[]
[]
[]
{"$rows_left_out":38}
{"sheet":"リスト","index":1,"n_rows":201,"n_cols":25,"rows_kept":201,"cut":false,"hidden":false,"merged":[[0,1,0,2]]}
[null,null,null,null,null,null,null,null,null,null,null,null,null,null,null,null,null,null,"男","女"]
[null,"会員ＩＤ","学年","姓","名","外字有無","せい","めい","男女","生年月日","現在段位","認許日","備考","会員登録日"]
[{"$f":"D3&\"　\"&E3","v":"　"},null,null,null,null,null,null,null,null,null,null,null,null,null,null,{"$f":"D3& \"　\"&E3","v":"　"},{"$f":"C3","v":0},{"$f":"I3","v":0},{"$f":"IF($R3=S$1,1,0)","v":0},{"$f":"IF($R3=T$1,1,0)","v":0},{"$f":"P3","v":"　"},{"$f":"Q3","v":0},1,{"$f":"IF(ISERROR(VLOOKUP($W3,$S$3:$V$201,3,FALSE)),\" \",VLOOKUP($W3,$S$3:$V$201,3,FALSE))","v":" "},{"$f":"IF(ISERROR(VLOOKUP($W3,$T$3:$V$201,2,FALSE)),\" \",VLOOKUP($W3,$T$3:$V$201,2,FALSE))","v":" "}]
[{"$f":"D4&\"　\"&E4","v":"　"},null,null,null,null,null,null,null,null,null,null,null,null,null,null,{"$f":"D4& \"　\"&E4","v":"　"},{"$f":"C4","v":0},{"$f":"I4","v":0},{"$f":"IF($R4=S$1,S3+1,0)","v":0},{"$f":"IF($R4=T$1,T3+1,0)","v":0},{"$f":"P4","v":"　"},{"$f":"Q4","v":0},2,{"$f":"IF(ISERROR(VLOOKUP($W4,$S$3:$V$201,3,FALSE)),\" \",VLOOKUP($W4,$S$3:$V$201,3,FALSE))","v":" "},{"$f":"IF(ISERROR(VLOOKUP($W4,$T$3:$V$201,2,FALSE)),\" \",VLOOKUP($W4,$T$3:$V$201,2,FALSE))","v":" "}]
["　",null,null,null,null,null,null,null,null,null,null,null,null,null,null,"　",0,0,{"$f":"IF($R5=S$1,MAX(S$3:S4)+1,0)","v":0},{"$f":"IF($R5=T$1,MAX(T$3:T4)+1,0)","v":0},"　",0,3," "," "]
["　",null,null,null,null,null,null,null,null,null,null,null,null,null,null,"　",0,0,{"$f":"IF($R6=S$1,MAX(S$3:S5)+1,0)","v":0},{"$f":"IF($R6=T$1,MAX(T$3:T5)+1,0)","v":0},"　",0,4," "," "]
["　",null,null,null,null,null,null,null,null,null,null,null,null,null,null,"　",0,0,{"$f":"IF($R7=S$1,MAX(S$3:S6)+1,0)","v":0},{"$f":"IF($R7=T$1,MAX(T$3:T6)+1,0)","v":0},"　",0,5," "," "]
["　",null,null,null,null,null,null,null,null,null,null,null,null,null,null,"　",0,0,{"$f":"IF($R8=S$1,MAX(S$3:S7)+1,0)","v":0},{"$f":"IF($R8=T$1,MAX(T$3:T7)+1,0)","v":0},"　",0,6," "," "]
["　",null,null,null,null,null,null,null,null,null,null,null,null,null,null,"　",0,0,{"$f":"IF($R9=S$1,MAX(S$3:S8)+1,0)","v":0},{"$f":"IF($R9=T$1,MAX(T$3:T8)+1,0)","v":0},"　",0,7," "," "]
["　",null,null,null,null,null,null,null,null,null,null,null,null,null,null,"　",0,0,{"$f":"IF($R10=S$1,MAX(S$3:S9)+1,0)","v":0},{"$f":"IF($R10=T$1,MAX(T$3:T9)+1,0)","v":0},"　",0,8," "," "]
["　",null,null,null,null,null,null,null,null,null,null,null,null,null,null,"　",0,0,{"$f":"IF($R11=S$1,MAX(S$3:S10)+1,0)","v":0},{"$f":"IF($R11=T$1,MAX(T$3:T10)+1,0)","v":0},"　",0,9," "," "]
["　",null,null,null,null,null,null,null,null,null,null,null,null,null,null,"　",0,0,{"$f":"IF($R12=S$1,MAX(S$3:S11)+1,0)","v":0},{"$f":"IF($R12=T$1,MAX(T$3:T11)+1,0)","v":0},"　",0,10," "," "]
["　",null,null,null,null,null,null,null,null,null,null,null,null,null,null,"　",0,0,{"$f":"IF($R13=S$1,MAX(S$3:S12)+1,0)","v":0},{"$f":"IF($R13=T$1,MAX(T$3:T12)+1,0)","v":0},"　",0,11," "," "]
["　",null,null,null,null,null,null,null,null,null,null,null,null,null,null,"　",0,0,{"$f":"IF($R14=S$1,MAX(S$3:S13)+1,0)","v":0},{"$f":"IF($R14=T$1,MAX(T$3:T13)+1,0)","v":0},"　",0,12," "," "]
["　",null,null,null,null,null,null,null,null,null,null,null,null,null,null,"　",0,0,{"$f":"IF($R15=S$1,MAX(S$3:S14)+1,0)","v":0},{"$f":"IF($R15=T$1,MAX(T$3:T14)+1,0)","v":0},"　",0,13," "," "]
["　",null,null,null,null,null,null,null,null,null,null,null,null,null,null,"　",0,0,{"$f":"IF($R16=S$1,MAX(S$3:S15)+1,0)","v":0},{"$f":"IF($R16=T$1,MAX(T$3:T15)+1,0)","v":0},"　",0,14," "," "]
["　",null,null,null,null,null,null,null,null,null,null,null,null,null,null,"　",0,0,{"$f":"IF($R17=S$1,MAX(S$3:S16)+1,0)","v":0},{"$f":"IF($R17=T$1,MAX(T$3:T16)+1,0)","v":0},"　",0,15," "," "]
["　",null,null,null,null,null,null,null,null,null,null,null,null,null,null,"　",0,0,{"$f":"IF($R18=S$1,MAX(S$3:S17)+1,0)","v":0},{"$f":"IF($R18=T$1,MAX(T$3:T17)+1,0)","v":0},"　",0,16," "," "]
["　",null,null,null,null,null,null,null,null,null,null,null,null,null,null,{"$f":"D19& \"　\"&E19","v":"　"},{"$f":"C19","v":0},{"$f":"I19","v":0},{"$f":"IF($R19=S$1,MAX(S$3:S18)+1,0)","v":0},{"$f":"IF($R19=T$1,MAX(T$3:T18)+1,0)","v":0},{"$f":"P19","v":"　"},{"$f":"Q19","v":0},17," "," "]
["　",null,null,null,null,null,null,null,null,null,null,null,null,null,null,"　",0,0,{"$f":"IF($R20=S$1,MAX(S$3:S19)+1,0)","v":0},{"$f":"IF($R20=T$1,MAX(T$3:T19)+1,0)","v":0},"　",0,18," "," "]
{"$rows_left_out":182}
{"sheet":"中野優勝旗","index":2,"n_rows":342,"n_cols":61,"rows_kept":342,"cut":false,"hidden":false,"merged":[[2,2,2,4],[2,5,2,9],[0,1,0,36],[1,2,1,4],[1,5,1,36],[9,0,11,0],[9,1,11,1],[9,2,11,2],[9,4,9,9],[9,27,11,27],[9,28,11,28],[5,4,5,9],[5,31,5,36],[6,0,8,0],[6,1,8,1],[6,2,8,2],[6,4,6,9],[6,27,8,27],[6,28,8,28],[6,29,8,29],[6,31,6,36],[9,29,11,29],[9,31,9,36],[10,4,10,9],[10,31,10,36],[11,4,11,9],[11,31,11,36],[7,4,7,9],[7,31,7,36],[8,4,8,9],[8,31,8,36],[12,29,14,29],[12,31,12,36],[13,4,13,9],[13,31,13,36],[14,4,14,9],[14,31,14,36],[12,0,14,0],[12,1,14,1],[12,2,14,2],[12,4,12,9],[12,27,14,27],[12,28,14,28],[15,29,17,29],[15,31,15,36],[16,4,16,9],[16,31,16,36],[17,4,17,9],[17,31,17,36],[15,0,17,0],[15,1,17,1],[15,2,17,2],[15,4,15,9],[15,27,17,27],[15,28,17,28],[18,29,20,29],[18,31,18,36],[19,4,19,9],[19,31,19,36],[20,4,20,9],[20,31,20,36],[18,0,20,0],[18,1,20,1],[18,2,20,2],[18,4,18,9],[18,27,20,27],[18,28,20,28],[21,29,23,29],[21,31,21,36],[22,4,22,9],[22,31,22,36],[23,4,23,9],[23,31,23,36],[21,0,23,0],[21,1,23,1],[21,2,23,2],[21,4,21,9],[21,27,23,27],[21,28,23,28],[24,29,26,29],[24,31,24,36],[25,4,25,9],[25,31,25,36],[26,4,26,9],[26,31,26,36],[24,25,26,25],[24,0,26,0],[24,1,26,1],[24,2,26,2],[24,4,24,9],[24,27,26,27],[24,28,26,28],[27,31,27,36],[28,4,28,9],[28,31,28,36],[29,4,29,9],[29,31,29,36],[27,25,29,25],[27,0,29,0],[27,1,29,1],[27,2,29,2],[27,4,27,9],[27,27,29,27],[27,28,29,28],[31,4,31,9],[31,31,31,36],[32,4,32,9],[32,31,32,36],[30,25,32,25],[30,0,32,0],[30,1,32,1],[30,2,32,2],[30,4,30,9],[30,27,32,27],[30,28,32,28],[34,4,34,9],[34,31,34,36],[35,4,35,9],[35,31,35,36],[33,25,35,25],[33,0,35,0],[33,1,35,1],[33,2,35,2],[33,4,33,9],[33,27,35,27],[33,28,35,28],[37,4,37,9],[37,31,37,36],[38,4,38,9],[38,31,38,36],[36,25,38,25],[36,0,38,0],[36,1,38,1],[36,2,38,2],[36,4,36,9],[36,27,38,27],[36,28,38,28],[40,4,40,9],[40,31,40,36],[41,4,41,9],[41,31,41,36],[39,25,41,25],[39,0,41,0],[39,1,41,1],[39,2,41,2],[39,4,39,9],[39,27,41,27],[39,28,41,28],[43,4,43,9],[43,31,43,36],[44,4,44,9],[44,31,44,36],[42,25,44,25],[42,0,44,0],[42,1,44,1],[42,2,44,2],[42,4,42,9],[42,27,44,27],[42,28,44,28],[48,0,50,0],[48,1,50,1],[48,2,50,2],[48,4,48,9],[48,27,50,27],[48,28,50,28],[45,29,47,29],[45,31,45,36],[46,4,46,9],[46,31,46,36],[47,4,47,9],[47,31,47,36],[45,25,47,25],[45,0,47,0],[45,1,47,1],[45,2,47,2],[45,4,45,9],[45,27,47,27],[45,28,47,28],[54,0,56,0],[54,1,56,1],[54,2,56,2],[54,4,54,9],[54,27,56,27],[54,28,56,28],[51,29,53,29],[51,31,51,36],[52,4,52,9],[52,31,52,36],[53,4,53,9],[53,31,53,36],[51,25,53,25],[51,0,53,0],[51,1,53,1],[51,2,53,2],[51,4,51,9],[51,27,53,27],[51,28,53,28],[57,2,57,3],[57,4,57,9],[57,29,57,30],[57,31,57,36],[6,25,8,25],[9,25,11,25],[12,25,14,25],[15,25,17,25],[18,25,20,25],[21,25,23,25],[54,29,56,29],[54,31,54,36],[55,4,55,9],[55,31,55,36],[56,4,56,9],[56,31,56,36],[54,25,56,25],[48,29,50,29],[48,31,48,36],[49,4,49,9],[49,31,49,36],[50,4,50,9],[50,31,50,36],[48,25,50,25],[51,52,53,52],[54,52,56,52],[21,52,23,52],[24,52,26,52],[27,52,29,52],[30,52,32,52],[33,52,35,52],[36,52,38,52],[5,39,5,42],[5,43,5,46],[5,47,5,50],[5,51,5,52],[6,52,8,52],[9,52,11,52],[12,52,14,52],[15,52,17,52],[18,52,20,52],[3,32,4,52],[2,41,2,43],[2,10,2,15],[2,16,2,20],[2,21,2,25],[39,52,41,52],[42,52,44,52],[45,52,47,52],[48,52,50,52],[5,12,5,15],[5,16,5,19],[5,20,5,23],[5,24,5,25],[42,29,44,29],[42,31,42,36],[39,29,41,29],[39,31,39,36],[36,29,38,29],[36,31,36,36],[33,29,35,29],[33,31,33,36],[30,29,32,29],[30,31,30,36],[27,29,29,29]]}
[null,"令和３年度\n第45回中野優勝旗記念弓道大会　申し込み",null,null,null,null,null,null,null,null,null,null,null,null,null,null,null,null,null,null,null,null,null,null,null,null,null,null,null,null,null,null,null,null,null,null,null,null,null,null,null,null,null,null,null,null,null,null,null,null,null,null,null,null,null,null,6,20,21,22,23]
[null,null,"学校名\n（正式名称）",null,null,null,null,null,null,null,null,null,null,null,null,null,null,null,null,null,null,null,null,null,null,null,null,null,null,null,null,null,null,null,null,null,null,null,null,null,null,null,null,null,null,null,null,null,null,null,null,null,null,null,null,null,{"$f":"IF(ISERROR(VLOOKUP($F$2,$A$63:$BE$139,BE1,FALSE)),\"\",VLOOKUP($F$2,$A$63:$BE$139,BE1,FALSE))","v":""},{"$f":"IF(ISERROR(VLOOKUP($F$2,$A$63:$BE$139,BF1,FALSE)),\"\",VLOOKUP($F$2,$A$63:$BE$139,BF1,FALSE))","v":""},{"$f":"IF(ISERROR(VLOOKUP($F$2,$A$63:$BE$139,BG1,FALSE)),\"\",VLOOKUP($F$2,$A$63:$BE$139,BG1,FALSE))","v":""},{"$f":"IF(ISERROR(VLOOKUP($F$2,$A$63:$BE$139,BH1,FALSE)),\"\",VLOOKUP($F$2,$A$63:$BE$139,BH1,FALSE))","v":""},{"$f":"IF(ISERROR(VLOOKUP($F$2,$A$63:$BE$139,BI1,FALSE)),\"\",VLOOKUP($F$2,$A$63:$BE$139,BI1,FALSE))","v":""}]
[null,null,"立会顧問"]
[null,null,null,null,null,null,null,null,null,"※2人目以降はこちらに入力",null,null,null,null,null,null,null,null,null,null,null,null,null,null,null,null,null,null,null,null,null,null,"入力が終わりましたら、このボタンを押して、「申込みファイル」を作成し、そのファイルの方をメールで送って下さい。"]
[null,null,"男子",null,null,null,null,null,null,null,null,null,null,null,null,null,null,null,null,null,null,null,null,null,null,null,null,null,null,"女子"]
[null,"男女","チーム","立順","選手名",null,null,null,null,null,"学年",null,"１回戦",null,null,null,"２回戦",null,null,null,"３回戦",null,null,null,"計",null,"備考",null,"男女","チーム","立順","選手名",null,null,null,null,null,"学年",null,"１回戦",null,null,null,"２回戦",null,null,null,"３回戦",null,null,null,"計",null,"備考"]
["A","男子",{"$f":"IF(LEN($BE$2)=0,\"\",$BE$2&A7)","v":""},1,null,null,null,null,null,null,{"$f":"IF(LEN(E7)=0,\"\",VLOOKUP(E7,リスト!$A$3:$N$201,3,FALSE))","v":""},{"$f":"IF(LEN(E7)=0,\"\",VLOOKUP(E7,リスト!$A$3:$N$201,2,FALSE))","v":""},null,null,null,null,null,null,null,null,null,null,null,null,{"$f":"COUNTIF(M7:X7,\"○\")+COUNTIF(M7:X7,\"×（○）\")","v":0},{"$f":"COUNTIF(M7:X9,\"○\")","v":0},null,"A","女子",{"$f":"IF(LEN($BE$2)=0,\"\",$BE$2&AB7)","v":""},1,null,null,null,null,null,null,{"$f":"IF(LEN(AF7)=0,\"\",VLOOKUP(AF7,リスト!$A$3:$N$201,3,FALSE))","v":""},{"$f":"IF(LEN(AF7)=0,\"\",VLOOKUP(AF7,リスト!$A$3:$N$201,2,FALSE))","v":""},null,null,null,null,null,null,null,null,null,null,null,null,{"$f":"COUNTIF(AN7:AY7,\"○\")+COUNTIF(AN7:AY7,\"×（○）\")","v":0},{"$f":"COUNTIF(AN7:AY9,\"○\")","v":0},null,null,null,{"$f":"COUNTA(E7:J9)","v":0},{"$f":"COUNTA(AF7:AK9)","v":0}]
[null,null,null,2,null,null,null,null,null,null,{"$f":"IF(LEN(E8)=0,\"\",VLOOKUP(E8,リスト!$A$3:$N$201,3,FALSE))","v":""},{"$f":"IF(LEN(E8)=0,\"\",VLOOKUP(E8,リスト!$A$3:$N$201,2,FALSE))","v":""},null,null,null,null,null,null,null,null,null,null,null,null,{"$f":"COUNTIF(M8:X8,\"○\")+COUNTIF(M8:X8,\"×（○）\")","v":0},null,null,null,null,null,2,null,null,null,null,null,null,{"$f":"IF(LEN(AF8)=0,\"\",VLOOKUP(AF8,リスト!$A$3:$N$201,3,FALSE))","v":""},{"$f":"IF(LEN(AF8)=0,\"\",VLOOKUP(AF8,リスト!$A$3:$N$201,2,FALSE))","v":""},null,null,null,null,null,null,null,null,null,null,null,null,{"$f":"COUNTIF(AN8:AY8,\"○\")+COUNTIF(AN8:AY8,\"×（○）\")","v":0},null,null,null,null,{"$f":"COUNTA(E7:J9)","v":0},{"$f":"COUNTA(AF7:AK9)","v":0}]
[null,null,null,3,null,null,null,null,null,null,{"$f":"IF(LEN(E9)=0,\"\",VLOOKUP(E9,リスト!$A$3:$N$201,3,FALSE))","v":""},{"$f":"IF(LEN(E9)=0,\"\",VLOOKUP(E9,リスト!$A$3:$N$201,2,FALSE))","v":""},null,null,null,null,null,null,null,null,null,null,null,null,0,null,null,null,null,null,3,null,null,null,null,null,null,{"$f":"IF(LEN(AF9)=0,\"\",VLOOKUP(AF9,リスト!$A$3:$N$201,3,FALSE))","v":""},{"$f":"IF(LEN(AF9)=0,\"\",VLOOKUP(AF9,リスト!$A$3:$N$201,2,FALSE))","v":""},null,null,null,null,null,null,null,null,null,null,null,null,0,null,null,null,null,{"$f":"COUNTA(E7:J9)","v":0},{"$f":"COUNTA(AF7:AK9)","v":0}]
["B","男子",{"$f":"IF(LEN($BE$2)=0,\"\",$BE$2&A10)","v":""},1,null,null,null,null,null,null,{"$f":"IF(LEN(E10)=0,\"\",VLOOKUP(E10,リスト!$A$3:$N$201,3,FALSE))","v":""},{"$f":"IF(LEN(E10)=0,\"\",VLOOKUP(E10,リスト!$A$3:$N$201,2,FALSE))","v":""},null,null,null,null,null,null,null,null,null,null,null,null,0,{"$f":"COUNTIF(M10:X12,\"○\")","v":0},null,"B","女子",{"$f":"IF(LEN($BE$2)=0,\"\",$BE$2&AB10)","v":""},1,null,null,null,null,null,null,{"$f":"IF(LEN(AF10)=0,\"\",VLOOKUP(AF10,リスト!$A$3:$N$201,3,FALSE))","v":""},{"$f":"IF(LEN(AF10)=0,\"\",VLOOKUP(AF10,リスト!$A$3:$N$201,2,FALSE))","v":""},null,null,null,null,null,null,null,null,null,null,null,null,0,{"$f":"COUNTIF(AN10:AY12,\"○\")","v":0},null,null,null,{"$f":"COUNTA(E10:J12)","v":0},{"$f":"COUNTA(AF10:AK12)","v":0}]
[null,null,null,2,null,null,null,null,null,null,{"$f":"IF(LEN(E11)=0,\"\",VLOOKUP(E11,リスト!$A$3:$N$201,3,FALSE))","v":""},{"$f":"IF(LEN(E11)=0,\"\",VLOOKUP(E11,リスト!$A$3:$N$201,2,FALSE))","v":""},null,null,null,null,null,null,null,null,null,null,null,null,0,null,null,null,null,null,2,null,null,null,null,null,null,{"$f":"IF(LEN(AF11)=0,\"\",VLOOKUP(AF11,リスト!$A$3:$N$201,3,FALSE))","v":""},{"$f":"IF(LEN(AF11)=0,\"\",VLOOKUP(AF11,リスト!$A$3:$N$201,2,FALSE))","v":""},null,null,null,null,null,null,null,null,null,null,null,null,0,null,null,null,null,{"$f":"COUNTA(E10:J12)","v":0},{"$f":"COUNTA(AF10:AK12)","v":0}]
[null,null,null,3,null,null,null,null,null,null,{"$f":"IF(LEN(E12)=0,\"\",VLOOKUP(E12,リスト!$A$3:$N$201,3,FALSE))","v":""},{"$f":"IF(LEN(E12)=0,\"\",VLOOKUP(E12,リスト!$A$3:$N$201,2,FALSE))","v":""},null,null,null,null,null,null,null,null,null,null,null,null,0,null,null,null,null,null,3,null,null,null,null,null,null,{"$f":"IF(LEN(AF12)=0,\"\",VLOOKUP(AF12,リスト!$A$3:$N$201,3,FALSE))","v":""},{"$f":"IF(LEN(AF12)=0,\"\",VLOOKUP(AF12,リスト!$A$3:$N$201,2,FALSE))","v":""},null,null,null,null,null,null,null,null,null,null,null,null,0,null,null,null,null,{"$f":"COUNTA(E10:J12)","v":0},{"$f":"COUNTA(AF10:AK12)","v":0}]
["C","男子",{"$f":"IF(LEN($BE$2)=0,\"\",$BE$2&A13)","v":""},1,null,null,null,null,null,null,{"$f":"IF(LEN(E13)=0,\"\",VLOOKUP(E13,リスト!$A$3:$N$201,3,FALSE))","v":""},{"$f":"IF(LEN(E13)=0,\"\",VLOOKUP(E13,リスト!$A$3:$N$201,2,FALSE))","v":""},null,null,null,null,null,null,null,null,null,null,null,null,0,{"$f":"COUNTIF(M13:X15,\"○\")","v":0},null,"C","女子",{"$f":"IF(LEN($BE$2)=0,\"\",$BE$2&AB13)","v":""},1,null,null,null,null,null,null,{"$f":"IF(LEN(AF13)=0,\"\",VLOOKUP(AF13,リスト!$A$3:$N$201,3,FALSE))","v":""},{"$f":"IF(LEN(AF13)=0,\"\",VLOOKUP(AF13,リスト!$A$3:$N$201,2,FALSE))","v":""},null,null,null,null,null,null,null,null,null,null,null,null,0,{"$f":"COUNTIF(AN13:AY15,\"○\")","v":0},null,null,null,{"$f":"COUNTA(E13:J15)","v":0},{"$f":"COUNTA(AF13:AK15)","v":0}]
[null,null,null,2,null,null,null,null,null,null,{"$f":"IF(LEN(E14)=0,\"\",VLOOKUP(E14,リスト!$A$3:$N$201,3,FALSE))","v":""},{"$f":"IF(LEN(E14)=0,\"\",VLOOKUP(E14,リスト!$A$3:$N$201,2,FALSE))","v":""},null,null,null,null,null,null,null,null,null,null,null,null,0,null,null,null,null,null,2,null,null,null,null,null,null,{"$f":"IF(LEN(AF14)=0,\"\",VLOOKUP(AF14,リスト!$A$3:$N$201,3,FALSE))","v":""},{"$f":"IF(LEN(AF14)=0,\"\",VLOOKUP(AF14,リスト!$A$3:$N$201,2,FALSE))","v":""},null,null,null,null,null,null,null,null,null,null,null,null,0,null,null,null,null,{"$f":"COUNTA(E13:J15)","v":0},{"$f":"COUNTA(AF13:AK15)","v":0}]
[null,null,null,3,null,null,null,null,null,null,{"$f":"IF(LEN(E15)=0,\"\",VLOOKUP(E15,リスト!$A$3:$N$201,3,FALSE))","v":""},{"$f":"IF(LEN(E15)=0,\"\",VLOOKUP(E15,リスト!$A$3:$N$201,2,FALSE))","v":""},null,null,null,null,null,null,null,null,null,null,null,null,0,null,null,null,null,null,3,null,null,null,null,null,null,{"$f":"IF(LEN(AF15)=0,\"\",VLOOKUP(AF15,リスト!$A$3:$N$201,3,FALSE))","v":""},{"$f":"IF(LEN(AF15)=0,\"\",VLOOKUP(AF15,リスト!$A$3:$N$201,2,FALSE))","v":""},null,null,null,null,null,null,null,null,null,null,null,null,0,null,null,null,null,{"$f":"COUNTA(E13:J15)","v":0},{"$f":"COUNTA(AF13:AK15)","v":0}]
["D","男子",{"$f":"IF(LEN($BE$2)=0,\"\",$BE$2&A16)","v":""},1,null,null,null,null,null,null,{"$f":"IF(LEN(E16)=0,\"\",VLOOKUP(E16,リスト!$A$3:$N$201,3,FALSE))","v":""},{"$f":"IF(LEN(E16)=0,\"\",VLOOKUP(E16,リスト!$A$3:$N$201,2,FALSE))","v":""},null,null,null,null,null,null,null,null,null,null,null,null,0,{"$f":"COUNTIF(M16:X18,\"○\")","v":0},null,"D","女子",{"$f":"IF(LEN($BE$2)=0,\"\",$BE$2&AB16)","v":""},1,null,null,null,null,null,null,{"$f":"IF(LEN(AF16)=0,\"\",VLOOKUP(AF16,リスト!$A$3:$N$201,3,FALSE))","v":""},{"$f":"IF(LEN(AF16)=0,\"\",VLOOKUP(AF16,リスト!$A$3:$N$201,2,FALSE))","v":""},null,null,null,null,null,null,null,null,null,null,null,null,0,{"$f":"COUNTIF(AN16:AY18,\"○\")","v":0},null,null,null,{"$f":"COUNTA(E16:J18)","v":0},{"$f":"COUNTA(AF16:AK18)","v":0}]
[null,null,null,2,null,null,null,null,null,null,{"$f":"IF(LEN(E17)=0,\"\",VLOOKUP(E17,リスト!$A$3:$N$201,3,FALSE))","v":""},{"$f":"IF(LEN(E17)=0,\"\",VLOOKUP(E17,リスト!$A$3:$N$201,2,FALSE))","v":""},null,null,null,null,null,null,null,null,null,null,null,null,0,null,null,null,null,null,2,null,null,null,null,null,null,{"$f":"IF(LEN(AF17)=0,\"\",VLOOKUP(AF17,リスト!$A$3:$N$201,3,FALSE))","v":""},{"$f":"IF(LEN(AF17)=0,\"\",VLOOKUP(AF17,リスト!$A$3:$N$201,2,FALSE))","v":""},null,null,null,null,null,null,null,null,null,null,null,null,0,null,null,null,null,{"$f":"COUNTA(E16:J18)","v":0},{"$f":"COUNTA(AF16:AK18)","v":0}]
[null,null,null,3,null,null,null,null,null,null,{"$f":"IF(LEN(E18)=0,\"\",VLOOKUP(E18,リスト!$A$3:$N$201,3,FALSE))","v":""},{"$f":"IF(LEN(E18)=0,\"\",VLOOKUP(E18,リスト!$A$3:$N$201,2,FALSE))","v":""},null,null,null,null,null,null,null,null,null,null,null,null,0,null,null,null,null,null,3,null,null,null,null,null,null,{"$f":"IF(LEN(AF18)=0,\"\",VLOOKUP(AF18,リスト!$A$3:$N$201,3,FALSE))","v":""},{"$f":"IF(LEN(AF18)=0,\"\",VLOOKUP(AF18,リスト!$A$3:$N$201,2,FALSE))","v":""},null,null,null,null,null,null,null,null,null,null,null,null,0,null,null,null,null,{"$f":"COUNTA(E16:J18)","v":0},{"$f":"COUNTA(AF16:AK18)","v":0}]
["E","男子",{"$f":"IF(LEN($BE$2)=0,\"\",$BE$2&A19)","v":""},1,null,null,null,null,null,null,{"$f":"IF(LEN(E19)=0,\"\",VLOOKUP(E19,リスト!$A$3:$N$201,3,FALSE))","v":""},{"$f":"IF(LEN(E19)=0,\"\",VLOOKUP(E19,リスト!$A$3:$N$201,2,FALSE))","v":""},null,null,null,null,null,null,null,null,null,null,null,null,0,{"$f":"COUNTIF(M19:X21,\"○\")","v":0},null,"E","女子",{"$f":"IF(LEN($BE$2)=0,\"\",$BE$2&AB19)","v":""},1,null,null,null,null,null,null,{"$f":"IF(LEN(AF19)=0,\"\",VLOOKUP(AF19,リスト!$A$3:$N$201,3,FALSE))","v":""},{"$f":"IF(LEN(AF19)=0,\"\",VLOOKUP(AF19,リスト!$A$3:$N$201,2,FALSE))","v":""},null,null,null,null,null,null,null,null,null,null,null,null,0,{"$f":"COUNTIF(AN19:AY21,\"○\")","v":0},null,null,null,{"$f":"COUNTA(E19:J21)","v":0},{"$f":"COUNTA(AF19:AK21)","v":0}]
[null,null,null,2,null,null,null,null,null,null,{"$f":"IF(LEN(E20)=0,\"\",VLOOKUP(E20,リスト!$A$3:$N$201,3,FALSE))","v":""},{"$f":"IF(LEN(E20)=0,\"\",VLOOKUP(E20,リスト!$A$3:$N$201,2,FALSE))","v":""},null,null,null,null,null,null,null,null,null,null,null,null,0,null,null,null,null,null,2,null,null,null,null,null,null,{"$f":"IF(LEN(AF20)=0,\"\",VLOOKUP(AF20,リスト!$A$3:$N$201,3,FALSE))","v":""},{"$f":"IF(LEN(AF20)=0,\"\",VLOOKUP(AF20,リスト!$A$3:$N$201,2,FALSE))","v":""},null,null,null,null,null,null,null,null,null,null,null,null,0,null,null,null,null,{"$f":"COUNTA(E19:J21)","v":0},{"$f":"COUNTA(AF19:AK21)","v":0}]
{"$rows_left_out":322}